{"text_format":"1","workbook":"xlsx","n_sheets":5,"sheets":["Home","Ruleset","Examples","Postal Codes","Parameter"],"not_rendered":{"charts":0,"images":20,"macros":1,"external_links":0,"defined_names":13,"comments":0,"pivot_tables":0},"unopened":[],"bounds":{"document_bytes":16777216,"sheet_cells":100000,"rows_first":2000,"rows_last":500,"rows_between":2000,"halvings":0,"cell_chars":16384,"cell_head_chars":4096},"cells_cut":0,"cells_raw":0,"read":"whole","date_system":"1900"}

{"sheet":"Home","index":0,"n_rows":36,"n_cols":13,"rows_kept":36,"cut":false,"hidden":false,"merged":[[22,8,24,10]]}
[]
[]
[]
[]
[]
[]
[]
["© 2010 by e-Consultance"]
["Norbert Eiglsperger"]
["Dr.-Böttcher-Straße 31",null,null,null,null,null,null,null,null,null,null,null,"Address-Format-Machine V1.0"]
["D-81245 München"]
["0049/175/2984383"]
["0043/68/110 622 322"]
["http://www.e-consultance.de"]
[]
[]
[]
[]
[]
[null,"Number or testcases included:",null,null,{"$f":"Examples!E1","v":40}]
[null,"Current Domestic Country",null,null,{"$f":"VLOOKUP(Parameter!B30,'Postal Codes'!A1:B257,2,FALSE)","v":"Austria"}]
[null,"Current max lines for labels",null,null,{"$f":"Parameter!B31","v":5}]
[null,"Maximim length per line",null,null,{"$f":"Parameter!B32","v":30},null,null,null,"By starting Tool you accept licence."]
[]
[]
[]
[]
[null,"Licence:"]
[null,"You may test this application as long as you want."]
[null,"You must not copy the basic approach of this software solution, nor copy the knowledge of addressformatting."]
[null,"For using this application within your private of business environment you need a proper licence, that can be"]
[null,"checked with an licence key. Without licence key, you can test the encluded examples, but cannot enter a"]
[null,"house number."]
[null,"Price and conditions of a licence is depending on the future use and additional implementation"]
[null,"support i.e. consulting contracts."]
[null,"Note: Housenumber cannot be changed without licence key."]

{"sheet":"Ruleset","index":1,"n_rows":589,"n_cols":14,"rows_kept":589,"cut":false,"hidden":true,"merged":[]}
["Default:"]
[0,null,null,null,null,null,null,null,null,null,null,null,"Reserved for Confidential"]
[1,"[Heading1]",null,null,null,null,null,null,null,null,null,null,1,"for addresse-Area (1-3"]
[2,"[Heading2]",null,null,null,null,null,null,null,null,null,null,2]
[3,"[Heading3]",null,null,null,null,null,null,null,null,null,null,3,"c/o line if available"]
[4,"[Street] ","\"o\"","[Number]","{","\"/\"","[Addr. Complement]","}",null,null,null,null,4,"Street"]
[5,"[City] ","\"o\"","[City Complement] ","\"o\"","[Zip code]",null,null,null,null,null,null,5,"City Complement Zip (as default international)"]
[6,"[Country]",null,null,null,null,null,null,null,null,null,null,6,"Country"]
[7,null,null,null,null,null,null,null,null,null,null,null,7,"sometimes used if we insert below street or City line (e.g. ZIP Code in GB)"]
[8,null,null,null,null,null,null,null,null,null,null,null,8,"not used yet"]
[9,null,null,null,null,null,null,null,null,null,null,null,9,"space to copy data"]
[]
[]
["//* GENERAL RULES HUMAN VS. COMPANY"]
[]
["// if human than insert human heading-part"]
["*"]
["0 check","[Human]",true]
[1,"[Salutary title]","\"o\"","[Profession title]"]
[2,"[Heading1]"]
[3,"[Profession name]"]
[]
["//* RULES FOR POST OFFICE BOX"]
[]
["// if po-box  is used replace line street (for human and companies), pobox has higher priority then street"]
["*"]
["0 check","[pobox]","-\"\""]
["0 define","[street]","\"PO Box \"","[pobox]"]
["0 define","[Number]","\"\""]
[]
["// if po-box  is used and German speaking countries insert \"Postfach\" while replacing line 3"]
["Deutschland"]
["Österreich"]
["Schweiz"]
["0 check","[pobox]","-\"\""]
["0 define","[street]","\"Postfach \"","[pobox]"]
[]
["// if po-box  is used and Iceland speaking Country insert \"Pósthólf \" while replacing line 3"]
["Island"]
["0 check","[pobox]","-\"\""]
{"$rows_left_out":550}
{"sheet":"Examples","index":2,"n_rows":656,"n_cols":8,"rows_kept":656,"cut":false,"hidden":false,"merged":[]}
["Data must be correct (for human non human), empty line to seperate Tcases",null,null,"#",{"$f":"MAX(D:D)","v":40},"Explanations and more informations"]
[null,"* Europa",null,0]
[null,null,null,{"$f":"IF(AND(A3<>\"\",A2=\"\"),INDEX($D:$D,ROW()-1,1)+1,INDEX($D:$D,ROW()-1,1))","v":0}]
[null,{"$f":"IF(NOT(ISERROR(VLOOKUP(\"country=\",A5:B21,2,FALSE))),VLOOKUP(\"country=\",A5:B21,2,FALSE),VLOOKUP(\"[Country]=\",A5:B21,2,FALSE))","v":"Deutschland"},null,0]
["human=","ü",null,1]
["salutary title=","Herr",null,1]
["heading 1=","Max Mustermann",null,1]
["street=","Bayerwaldstraße",null,1]
["number=","13b",null,1]
["zip=",94360,null,1]
["city=","Mitterfels",null,1]
["country=","Deutschland",null,1]
[null,null,null,1]
["human=","ü",null,2]
["confidential=","ü",null,2]
["salutary title=","Herr",null,2]
["profession title=","Dipl.Ingenieur",null,2]
["heading 1=","Max Mann",null,2]
["c/oline=","wg. Maria Mann",null,2]
["number=",10,null,2]
["street=","Kirchenweg",null,2]
["city complement=","Scheibelsgrub ",null,2]
["zip=",94360,null,2]
["city=","Mitterfels",null,2]
["country=","Deutschland",null,2]
[null,null,null,2]
["human=","ü",null,3]
["confidential=","ü",null,3]
["salutary title=","Herr",null,3]
["heading 1=","Max Mustermann",null,3]
["number=",2,null,3]
["street=",null,null,3]
["city=","Mitterfels",null,3]
["city complement=","Dunk",null,3]
["zip=",94360,null,3]
["city=","Mitterfels",null,3]
["country=","Deutschland",null,3]
[null,null,null,3]
["human=","ü",null,4]
["salutary title=","Herr und Frau",null,4,null,null,"Dorfstraße in 24217 Bendfeld "]
{"$rows_left_out":617}
{"sheet":"Postal Codes","index":3,"n_rows":257,"n_cols":28,"rows_kept":257,"cut":false,"hidden":true,"merged":[]}
["Chile","Country","Postal-Code","Country Hint?","Country Areas","Addr. Complement","Address Lines","City","City Complement","c/o Line","Company","Confidential","Country","Name 1","Name 2","Name 3","Human","Number","PO Box","Postal code","Profession name","Profession Title","Regular","Salutary Title","Sender Country","Street","Zip-Code"]
[{"$f":"IF(NOT(ISERROR(VLOOKUP($A$1,A7:A257,1,FALSE))),$A$1,\"\")","v":"Chile"},{"$f":"IF(A2=\"\",IF(NOT(ISERROR(VLOOKUP($A$1,B7:B257,1,FALSE))),$A$1,\"\"),\"\")","v":""},{"$f":"C3","v":"RCH"},{"$f":"D3","v":"WAHR"},{"$f":"SUBSTITUTE(IF(NOT(ISERROR(FIND(\" \",MID(E5,1,FIND(\":\",E5))))),\"\",IF(ISERROR(FIND(\":\",E5)),\"\",MID(E5,1,FIND(\":\",E5)-1))),\"_\",\" \")","v":""},{"$f":"SUBSTITUTE(IF(NOT(ISERROR(FIND(\" \",MID(F5,1,FIND(\":\",F5))))),\"\",IF(ISERROR(FIND(\":\",F5)),\"\",MID(F5,1,FIND(\":\",F5)-1))),\"_\",\" \")","v":""},"","","Provinces","","","","","","","","","","","","","","","","","",""]
[{"$f":"A5","v":"Chile"},{"$f":"B5","v":"Chile"},{"$f":"C5","v":"RCH"},{"$f":"D5","v":"WAHR"},{"$f":"TRIM(\" \"&MID(E5,LEN(E2)+IF(E2<>\"\",2,1),999))","v":""},"","","","Provinces are not used","","","","Almost standard address rules. (may be due to many German settlers?)\n\nEaster Island does not use Zip-Codes or house numbers, may be other areas like Patagonia or terra de la fuego (Feuerland) are similar.","","","","","","","","","","","","","",""]
["Working Area"]
[{"$f":"IF($A2<>\"\",VLOOKUP($A2,$A$7:$AA$257,COLUMN(),FALSE),\"\")&IF($B2<>\"\",VLOOKUP($B2,$B$7:$AB$257,COLUMN($AB$1)-1,FALSE),\"\")","v":"Chile"},{"$f":"IF($A2<>\"\",VLOOKUP($A2,$A$7:$AA$257,COLUMN(),FALSE),\"\")&IF($B2<>\"\",VLOOKUP($B2,$B$7:$AA$257,COLUMN()-1,FALSE),\"\")","v":"Chile"},"RCH","WAHR","","","","","Provinces: Provinces are not used","","","","Almost standard address rules. (may be due to many German settlers?)\n\nEaster Island does not use Zip-Codes or house numbers, may be other areas like Patagonia or terra de la fuego (Feuerland) are similar.","","","","","","","","","","","","","",""]
["Data Base Area"]
["Deutschland","Germany","D  ",{"$f":"M7<>\"\"","v":true},"","","","","Village: If a street name is not unique within an ZIP-Code, then add village or location name to make street name unique. If needed skip City name of zip-code and replace it by unique location name. ","","","","If a street name is not unique within an ZIP-Code, then add village or location name to make street name unique. If needed skip City name of zip-code and replace it by unique location name. Usually don´t use profession names","","","","","","","","Usually don´t use profession names","","","","","","",{"$f":"A7","v":"Deutschland"}]
["Italien","Italy","I  ",{"$f":"M8<>\"\"","v":true},"","","","","","","","","The abbreviation for the province should appear in the address, after the name of the locality, seperated with space","","","","","","","","","","","","","","",{"$f":"A8","v":"Italien"}]
["Österreich","Austria","A  ",{"$f":"M9<>\"\"","v":true},"","","","","Village: If a street name is not unique within an ZIP-Code, then add village or location name to make street name unique. If needed skip City name of zip-code and replace it by unique location name. ","","","","If a street name is not unique within an ZIP-Code, then add village or location name to make street name unique. If needed skip City name of zip-code and replace it by unique location name. Usually use profession names","","","","","","","","Usually use profession names","","","","","","",{"$f":"A9","v":"Österreich"}]
["Schweiz","Switzerland","CH ",false,"","","","","Village: If a street name is not unique within an ZIP-Code, then add village or location name to make street name unique. If needed skip City name of zip-code and replace it by unique location name. ","","","","","","","","","","","","","","","","","","","Schweiz"]
["Afghanistan","Afghanistan","AFG",true,"","","","","","","","","The address must be given in Latin letter.","","","","","","","","","","","","","","","Afghanistan"]
["Ägypten","Egypt","ET ",true,"","","","","","","","","The 5-figure zip code is to be stated under the city or provincial name. ","","","","","","","","","","","","","","","Ägypten"]
["Albanien","Albania","AL ",false,"","","","","","","","",null,"","","","","","","","","","","","","","","Albanien"]
["Algerien","Algeria","DZ ",false,"","","","","","","","","","","","","","","","","","","","","","","","Algerien"]
["Amerikanisch Samoa","American Samoa","AS ",false,"","","","","","","","","","","","","","","","","","","","","","","","Amerikanisch Samoa"]
["Samoa","Samoa","",false,"Use Amerikanische / American ….","","","","","","","","","","","","","","","","","","","","","","","Samoa"]
["Amerikanische Jungferninseln","American Virgin Island","AJ ",false,"","","","","","","","","","","","","","","","","","","","","","","","Amerikanische Jungferninseln"]
["Jungferninseln","Virgin Island","",false,"Use Amerikanische / American ….","","","","","","","","","","","","","","","","","","","","","","","Jungferninseln"]
["Andorra","Andorra","AND",false,"","","","","","","","","","","","","","","","","","","","","","","","Andorra"]
["Angola","Angola","ANG",false,"incl. Nordfolk Kokos- and Weihnachtsinseln Christmas Island","","","","","","","","","","","","","","","","","","","","","","","Angola"]
["Antarktis Territorium","Antarctica","AT ",false,"","","","","","","","","","","","","","","","","","","","","","","","Antarktis Territorium"]
["Äquatorialguinea","Equatorial Guinea","AQU",false,"","","","","","","","","","","","","","","","","","","","","","","","Äquatorialguinea"]
["Argentinien","Argentina","RA ",false,"","Piso,_Dept.: Use field Addr. Complement for \"Piso = level\" and \"Dept.=Door number\" informations","","","","","","","","","","","","","","","","","","","","","Argentina postal code (\"CPA\") has one letter + four digits + three letters","Argentinien"]
["Aserbaidschan","Azerbaijan","AZ ",false,"","","","","","","","","","","","","","","","","","","","","","","","Aserbaidschan"]
["Äthiopien","Ethiopia","ETH",true,"","","","","","","","","The address must be given in Latin letter.","","","","","","","","","","","","","","","Äthiopien"]
["Australien","Australia","AU",true,"","","","","State_/_Territory: Abbreviations (as of December 2005)\n        ACT Australian Capital Territory\n        NSW New South Wales\n        NT  Northern Territory\n        QLD Queensland\n        SA  South Australia\n        TAS Tasmania\n        VIC Victoria\n        WA  Western Australia\n       \n\n","","","","Enter State or Terretory into City Complement (without comma)\neach line should contain a maximum of 40 characters, including spaces; \nthe use of punctuation marks should be avoided; they are, however, acceptable in the line containing the addressee name, and are also accepted for separating specific address elements\nthe last two lines should be printed in upper case. ","","","","","","","","","","","","","Abbreviations for Types of Streets/Roads/etc. (as of December 2005)\n        ALLEY Alley\n        ARC   Arcade\n        AVE   Avenue\n        BVD   Boulevard\n        CL    Close\n        CRES  Crescent\n        DR    Drive\n        ESP   Esplanade\n        GR    Grove\n        HWY   Highway\n        LANE  Lane\n        PDE   Parade\n        PL    Place\n        RD    Road\n        SQ    Square\n        ST    Street\n        TCE   Terrace\n       ","","Australien"]
["Bahamas","Bahamas","BS ",false,"","","","","","","","","","","","","","","","","","","","","","","","Bahamas"]
["Bahrain","Bahrain","BRN",false,"","","","","","","","","","","","","","","","","","","","","","","","Bahrain"]
["Bangladesh","Bangladesh","BD ",false,"","","","","","","","","","","","","","","","","","","","","","","","Bangladesh"]
["Barbados","Barbados","BDS",false,"","","","","","","","","","","","","","","","","","","","","","","","Barbados"]
["Republik Belarus ","Republic of Belarus","BY ",false,"(Weißrußland)","","","","","","","","","","","","","","","","","","","","","","","Republik Belarus "]
["Belarus ","Belarus ","",false,"Use Republic of Belarus","","","","","","","","","","","","","","","","","","","","","","","Belarus "]
["Belgien","Belgium","B  ",true,"","","","","","","","","* each line of the address may contain at most 32 characters or spaces;\n* abbreviations should be used when the line contains more than 32 characters (see list below). ","","","","","","","","","","","","","","","Belgien"]
["Belize","Belize","BH ",false,"","","","","","","","","","","","","","","","","","","","","","","","Belize"]
["Benin","Benin","DY ",false,"","","","","","","","","","","","","","","","","","","","","","","","Benin"]
["Bermuda","Bermuda","BER",false,"","","","","","","","","","","","","","","","","","","","","","","","Bermuda"]
["Bolivien","Bolivia","BOL",false,"","","","","","","","","","","","","","","","","","","","","","","","Bolivien"]
["Bosnien-Herzegowina","Bosnia and Herzegovina","BIH",false,"","","","","","","","","","","","","","","","","","","","","","","","Bosnien-Herzegowina"]
["Botswana","Botswana","RB ",false,"","","","","","","","","","","","","","","","","","","","","","","","Botswana"]
["Brasilien","Brazil","BR ",true,"","","","","State_Abbr.: DF BRAZIL is District Federal Brazil, so enter Brazil may be twice:  BRASILIA - DF BRAZIL, Country= BRAZIL","","","","The state abbreviation (two characters) in City Complement must follow the town name, separated by a dash. The city of Brasilia is divided into sectors. The sectors appear as abbreviations in the address (three to four capital letters). A sector is divided into quadras, which are themselves divided into blocks.\n ","","","","","","","","","","","","","","","Brasilien"]
{"$rows_left_out":218}
{"sheet":"Parameter","index":4,"n_rows":300,"n_cols":5,"rows_kept":300,"cut":false,"hidden":true,"merged":[]}
["Priority of fields: If we have to shorten, then begin  to delte in this sorting order, not implemented yet",null,null,"Field","Fieldnotes"]
["professionname","delete first",null,"Addr. Complement","This is for appartmentnumbers, door numbers or similar extensions"]
["professiontitle",null,null,"Address lines","number of lines that shall be used for output (not complete implemented yet)"]
["salutarytitle",null,null,"City","Name of location referenced by ZIP-Code"]
["addrcomplement",null,null,"City Complement","If in D+A the street is not unique wihin an ZIP Code, then enter here the location or village that makes street name unique.\n\nFor Countries with usage of proincial codes, e.g. for USA you have to identify the state, then use this field to enter the area or region, state, province etc."]
["heading3",null,null,"Clear Field","Clears all fields to enter data manually."]
["heading2",null,null,"Close It","Closes UserForm."]
["citycomplement",null,null,"c/o Line","If within a company the mail shall be addressed to a special person:\n(To companyname)\nc/o Mrs. Smith\n\nif this letter was sent in behalf of another nat. person:\n(To Mr. Smith jun.)\nconcerning Mr. Smith sen.\n\nif this letter is sent using another person as transmitter:\n(To saving club)\nthough Mr. Smith"]
["postalcode",null,null,"Company","Opposite of Human"]
["city",null,null,"Confidential","Can only be assigned to D+A+CH addresses otherwise 5 lines cannot be granted."]
["zip",null,null,"Country","Country of addresse. Check if country is selected correctly. Some Countries in list have hints: Check them!"]
["country",null,null,"Name 1","In case of human: Include all academic titles, before, and after the name. Insert frist, second and surname. If line is too short: You can shorten second, then first name, skip \"after titles first\" then \"before titles\". Skip always lower titles first.\n\nFor companies this line is used always completely, other extension lines may not be  used, depending of  data."]
["number",null,null,"Name 2","For Companies an additional line for the name."]
["pobox",null,null,"Name 3","For Companies an additional line for the name."]
["street",null,null,"Human","Select type of addresse: Human for direct addresses as human, and other for all other kind of addresses"]
["coline",null,null,"Load Next Testcase",{"$f":"\"There are \"&Examples!E1&\" testcases. You can select the next testcase\"","v":"There are 40 testcases. You can select the next testcase"}]
["heading1",null,null,"Load Previous Testcase",{"$f":"\"There are \"&Examples!E4&\" testcases. You can select the last / previous  testcase\"","v":"There are  testcases. You can select the last / previous  testcase"}]
["confidential",null,null,"Number","Housenumber of addressee"]
["human","delete last",null,"PO Box","Post Office Box: If this field is used then street and number cannot be used, POBox and street are excluding logics."]
[null,null,null,"Postal Code","Internally generated code in front of zip-code. Shall not be used anymore, but to reduce to 5 lines this works still fine. So this code is officially not supported, but is so helpfull, that we cannot avoid to use it."]
[null,null,null,"Profession Name","This is the profession learned and usually executed, at least in former professional life. \ne.g. consultant"]
[null,null,null,"Profession Title","This are titles by professional or military education: \ne.g. Dipl.-Ing., General "]
[null,null,null,"Regular","non confidential"]
[null,null,null,"Salutary Title","To address natural poeple\ne.g. Mister, Mr., Mrs., Señora, Herr, Frau"]
[null,null,null,"Sender Country","Country of sender of mail. This is needed to identify domestic mailings."]
[null,null,null,"Street","If Street is used, POBox cannot be used. Street can be shortend by \"str.\" or similar abreviations according to the language of the country of the addresse."]
[null,null,null,"Zip-Code","Zip-Code in full length as it shall appear on address (e.g. for  USA with hypen inside)"]
[null,null,null,"Show Field Info","Opens this window to show this information."]
[null,null,null,"Show Country Hint","Shows information related to the country"]
["Domestic Country","Österreich"]
["Max. Number of Lines",5]
["Length of line",30]
[]
[]
[]
[]
[]
[]
[]
[]
{"$rows_left_out":260}